Reaction Details
TargetNeprilysin
LigandBDBM50039513
Substrate/Competitorn/a
Meas. Tech.ChEMBL_144466 (CHEMBL755532)
IC50 1.5±n/a nM
Citation Neustadt, BRSmith, EMNechuta, TLBronnenkant, AAHaslanger, MFWatkins, RWFoster, CJSybertz, EJ Mercaptoacyl amino acid inhibitors of atriopeptidase. 1. Structure-activity relationship studies of methionine and S-alkylcysteine derivatives. J Med Chem37:2461-76 (1994) Neprilysin
Name:Neprilysin
Type:Enzyme
Mol. Mass.:85570.75
Organism:Oryctolagus cuniculus (rabbit)
Description:NEP was purified to homogeneity from rabbit kidney.
Residue:750
BDBM50039513
NameBDBM50039513
Synonyms:(S)-2-((S)-2-Mercaptomethyl-3-phenyl-propionylamino)-3-methylsulfanyl-propionic acid | CHEMBL314418
TypeSmall organic molecule
Emp. Form.C14H19NO3S2
Mol. Mass.313.436
SMILESCSC[C@@H](NC(=O)[C@@H](CS)Cc1ccccc1)C(O)=O