Reaction Details
Target5-hydroxytryptamine receptor 1A
LigandBDBM10755
Substrate/Competitorn/a
Meas. Tech.ChEMBL_810 (CHEMBL767044)
EC50 10±n/a nM
Citation Macor, JEBlank, DHFox, CBLebel, LANewman, MEPost, RJRyan, KSchmidt, AWSchulz, DWKoe, BK 5-[(3-nitropyrid-2-yl)amino]indoles: novel serotonin agonists with selectivity for the 5-HT1D receptor. Variation of the C3 substituent on the indole template leads to increased 5-HT1D receptor selectivity. J Med Chem37:2509-12 (1994) 5-hydroxytryptamine receptor 1A
Name:5-hydroxytryptamine receptor 1A
Type:G Protein-Coupled Receptor (GPCR)
Mol. Mass.:46445.29
Organism:Rattus norvegicus (rat)
Description:Binding assays were performed using rat hippocampal membranes.
Residue:422
BDBM10755
NameBDBM10755
Synonyms:14C-5-hydroxy tryptamine creatinine disulfate 5-HT 5-hydroxy tryptamine creatinine disulfate Serotonin | [3H]-5-HT
TypeSmall organic molecule
Emp. Form.C10H12N2O
Mol. Mass.176.2151
SMILESNCCc1c[nH]c2ccc(O)cc12