Reaction Details
Target5-hydroxytryptamine receptor 2A
LigandBDBM50028601
Substrate/Competitorn/a
Meas. Tech.ChEMBL_2610 (CHEMBL617478)
Ki 2±n/a nM
Citation Phillips, STde Paulis, TBaron, BMSiegel, BWSeeman, PVan Tol, HHGuan, HCSmith, HE Binding of 5H-dibenzo[b,e][1,4]diazepine and chiral 5H-dibenzo[a,d]cycloheptene analogues of clozapine to dopamine and serotonin receptors. J Med Chem37:2686-96 (1994) 5-hydroxytryptamine receptor 2A
Name:5-hydroxytryptamine receptor 2A
Type:G Protein-Coupled Receptor (GPCR)
Mol. Mass.:52852.05
Organism:Rattus norvegicus (rat)
Description:Rat cortex membranes 5-HT2A receptors.
Residue:471
BDBM50028601
NameBDBM50028601
Synonyms:1-(8-Chloro-5H-dibenzo[a,d]cyclohepten-10-yl)-4-methyl-piperazine | CHEMBL7617
TypeSmall organic molecule
Emp. Form.C20H21ClN2
Mol. Mass.324.847
SMILESCN1CCN(CC1)C1=Cc2ccccc2Cc2ccc(Cl)cc12