Reaction Details
Target5-hydroxytryptamine receptor 3A/3B
LigandBDBM50028601
Substrate/Competitorn/a
Meas. Tech.ChEMBL_3236 (CHEMBL618922)
Ki 49±n/a nM
Citation Phillips, STde Paulis, TBaron, BMSiegel, BWSeeman, PVan Tol, HHGuan, HCSmith, HE Binding of 5H-dibenzo[b,e][1,4]diazepine and chiral 5H-dibenzo[a,d]cycloheptene analogues of clozapine to dopamine and serotonin receptors. J Med Chem37:2686-96 (1994) 5-hydroxytryptamine receptor 3A/3B
Name:5-hydroxytryptamine receptor 3A/3B
Type:n/a
Mol. Mass.:n/a
Description:ASSAY_ID of EBI is 2974
Components:This complex has 2 components.
Component 1
Name:5-hydroxytryptamine receptor 3B
Synonyms:5HT3B_RAT Serotonin (5-HT) receptor
Type:PROTEIN
Mol. Mass.:50328.78
Organism:Rattus norvegicus
Description:EBI_11885
Residue:437
Component 2
Name:5-hydroxytryptamine receptor 3A
Synonyms:5-HT3 5HT3A_RAT Htr3 Serotonin (5-HT) receptor | Zacopride site-R
Type:Enzyme Catalytic Domain
Mol. Mass.:55428.70
Organism:RAT
Description:5-HT3 HTR3A RAT::P35563
Residue:483
BDBM50028601
NameBDBM50028601
Synonyms:1-(8-Chloro-5H-dibenzo[a,d]cyclohepten-10-yl)-4-methyl-piperazine | CHEMBL7617
TypeSmall organic molecule
Emp. Form.C20H21ClN2
Mol. Mass.324.847
SMILESCN1CCN(CC1)C1=Cc2ccccc2Cc2ccc(Cl)cc12