Reaction Details
TargetAcetylcholinesterase
LigandBDBM50039716
Substrate/Competitorn/a
Meas. Tech.ChEMBL_28150 (CHEMBL644105)
IC50 55±n/a nM
Citation Villalobos, ABlake, JFBiggers, CKButler, TWChapin, DSChen, YLIves, JLJones, SBListon, DRNagel, AA Novel benzisoxazole derivatives as potent and selective inhibitors of acetylcholinesterase. J Med Chem37:2721-34 (1994) Acetylcholinesterase
Name:Acetylcholinesterase
Type:Enzyme
Mol. Mass.:67792.70
Organism:Homo sapiens (Human)
Description:P22303
Residue:614
BDBM50039716
NameBDBM50039716
Synonyms:3-(2-(1-benzylpiperidin-4-yl)ethyl)benzo[d]isoxazole CHEMBL92460
TypeSmall organic molecule
Emp. Form.C21H24N2O
Mol. Mass.320.4281
SMILESC(Cc1noc2ccccc12)C1CCN(Cc2ccccc2)CC1