Reaction Details
TargetType-1 angiotensin II receptor
LigandBDBM50039926
Substrate/Competitorn/a
Meas. Tech.ChEMBL_36630 (CHEMBL652869)
IC50 0.270000±n/a nM
Citation Ashton, WTChang, LLFlanagan, KLHutchins, SMNaylor, EMChakravarty, PKPatchett, AAGreenlee, WJChen, TBFaust, KA Triazolinone biphenylsulfonamide derivatives as orally active angiotensin II antagonists with potent AT1 receptor affinity and enhanced AT2 affinity. J Med Chem37:2808-24 (1994) Type-1 angiotensin II receptor
Name:Type-1 angiotensin II receptor
Type:Enzyme Catalytic Domain
Mol. Mass.:41009.15
Organism:RABBIT
Description:ANGIOTENSIN AT1 AGTR1 RABBIT::P34976
Residue:359
BDBM50039926
NameBDBM50039926
Synonyms:4'-[3-Butyl-5-oxo-1-(2-trifluoromethyl-phenyl)-1,5-dihydro-[1,2,4]triazol-4-ylmethyl]-biphenyl-2-sulfonic acid 2-trifluoromethyl-benzoylamide | CHEMBL407919
TypeSmall organic molecule
Emp. Form.C34H28F6N4O4S
Mol. Mass.702.666
SMILESCCCCc1nn(-c2ccccc2C(F)(F)F)c(=O)n1Cc1ccc(cc1)-c1ccccc1S(=O)(=O)NC(=O)c1ccccc1C(F)(F)F