Reaction Details
TargetType-1 angiotensin II receptor
LigandBDBM50039895
Substrate/Competitorn/a
Meas. Tech.ChEMBL_36630 (CHEMBL652869)
IC50 0.200000±n/a nM
Citation Ashton, WTChang, LLFlanagan, KLHutchins, SMNaylor, EMChakravarty, PKPatchett, AAGreenlee, WJChen, TBFaust, KA Triazolinone biphenylsulfonamide derivatives as orally active angiotensin II antagonists with potent AT1 receptor affinity and enhanced AT2 affinity. J Med Chem37:2808-24 (1994) Type-1 angiotensin II receptor
Name:Type-1 angiotensin II receptor
Type:Enzyme Catalytic Domain
Mol. Mass.:41009.15
Organism:RABBIT
Description:ANGIOTENSIN AT1 AGTR1 RABBIT::P34976
Residue:359
BDBM50039895
NameBDBM50039895
Synonyms:2-{4-[3-butyl-5-oxo-1-(2-trifluoromethylphenyl)-4,5-dihydro-1H-1,2,4-triazol-4-ylmethyl]phenyl}-1-(N-phenylsulphonyl)benzenesulfonamide | CHEMBL97332
TypeSmall organic molecule
Emp. Form.C32H29F3N4O5S2
Mol. Mass.670.722
SMILESCCCCc1nn(-c2ccccc2C(F)(F)F)c(=O)n1Cc1ccc(cc1)-c1ccccc1S(=O)(=O)NS(=O)(=O)c1ccccc1