Reaction Details
Target5-hydroxytryptamine receptor 1D
LigandBDBM50039947
Substrate/Competitorn/a
Meas. Tech.ChEMBL_2011 (CHEMBL617306)
Ki 16±n/a nM
Citation Glennon, RAHong, SSDukat, MTeitler, MDavis, K 5-(Nonyloxy)tryptamine: a novel high-affinity 5-HT1D beta serotonin receptor agonist. J Med Chem37:2828-30 (1994) 5-hydroxytryptamine receptor 1D
Name:5-hydroxytryptamine receptor 1D
Type:G Protein-Coupled Receptor (GPCR)
Mol. Mass.:41920.63
Organism:Homo sapiens (Human)
Description:Receptor binding assays were performed using human clone stably expressed in CHO cells.
Residue:377
BDBM50039947
NameBDBM50039947
Synonyms:2-(5-Nonyloxy-1H-indol-3-yl)-ethylamine | CHEMBL97450
TypeSmall organic molecule
Emp. Form.C19H30N2O
Mol. Mass.302.4543
SMILESCCCCCCCCCOc1ccc2[nH]cc(CCN)c2c1