Reaction Details
Target5-hydroxytryptamine receptor 1B
LigandBDBM10755
Substrate/Competitorn/a
Meas. Tech.ChEMBL_1799 (CHEMBL616772)
Ki 5.4±n/a nM
Citation Glennon, RAHong, SSDukat, MTeitler, MDavis, K 5-(Nonyloxy)tryptamine: a novel high-affinity 5-HT1D beta serotonin receptor agonist. J Med Chem37:2828-30 (1994) 5-hydroxytryptamine receptor 1B
Name:5-hydroxytryptamine receptor 1B
Type:Protein
Mol. Mass.:43173.33
Organism:Rattus norvegicus (Rat)
Description:P28564
Residue:386
BDBM10755
NameBDBM10755
Synonyms:14C-5-hydroxy tryptamine creatinine disulfate 5-HT 5-hydroxy tryptamine creatinine disulfate Serotonin | [3H]-5-HT
TypeSmall organic molecule
Emp. Form.C10H12N2O
Mol. Mass.176.2151
SMILESNCCc1c[nH]c2ccc(O)cc12