Reaction Details
TargetCalpain-1 catalytic subunit
LigandBDBM50039997
Substrate/Competitorn/a
Meas. Tech.ChEMBL_43688 (CHEMBL653666)
Ki 333±n/a nM
Citation Harbeson, SLAbelleira, SMAkiyama, ABarrett, RCarroll, RMStraub, JATkacz, JNWu, CMusso, GF Stereospecific synthesis of peptidyl alpha-keto amides as inhibitors of calpain. J Med Chem37:2918-29 (1994) Calpain-1 catalytic subunit
Name:Calpain-1 catalytic subunit
Type:Protein
Mol. Mass.:81880.51
Organism:Homo sapiens (Human)
Description:n/a
Residue:714
BDBM50039997
NameBDBM50039997
Synonyms:(S)-2-(3,3-Dimethyl-ureido)-4-methyl-pentanoic acid (3-ethylcarbamoyl-propyl)-amide | CHEMBL327501
TypeSmall organic molecule
Emp. Form.C15H30N4O3
Mol. Mass.314.4237
SMILESCCNC(=O)CCCNC(=O)[C@H](CC(C)C)NC(=O)N(C)C