Reaction Details
TargetCalpain-2 catalytic subunit
LigandBDBM50039993
Substrate/Competitorn/a
Meas. Tech.ChEMBL_43846 (CHEMBL658508)
Ki 138±n/a nM
Citation Harbeson, SLAbelleira, SMAkiyama, ABarrett, RCarroll, RMStraub, JATkacz, JNWu, CMusso, GF Stereospecific synthesis of peptidyl alpha-keto amides as inhibitors of calpain. J Med Chem37:2918-29 (1994) Calpain-2 catalytic subunit
Name:Calpain-2 catalytic subunit
Type:PROTEIN
Mol. Mass.:79905.09
Organism:Bos taurus
Description:ChEMBL_43846
Residue:700
BDBM50039993
NameBDBM50039993
Synonyms:CHEMBL330186 | [(S)-1-(3-Ethylcarbamoyl-propylcarbamoyl)-3-methyl-butyl]-carbamic acid benzyl ester
TypeSmall organic molecule
Emp. Form.C20H31N3O4
Mol. Mass.377.4778
SMILESCCNC(=O)CCCNC(=O)[C@H](CC(C)C)NC(=O)OCc1ccccc1