Reaction Details
TargetRetinoic acid receptor RXR-alpha
LigandBDBM50040023
Substrate/Competitorn/a
Meas. Tech.ChEMBL_196482 (CHEMBL798296)
Kd 706±n/a nM
Citation Boehm, MFZhang, LBadea, BAWhite, SKMais, DEBerger, ESuto, CMGoldman, MEHeyman, RA Synthesis and structure-activity relationships of novel retinoid X receptor-selective retinoids. J Med Chem37:2930-41 (1994) Retinoic acid receptor RXR-alpha
Name:Retinoic acid receptor RXR-alpha
Type:PROTEIN
Mol. Mass.:50820.38
Organism:Homo sapiens (Human)
Description:ChEMBL_1456363
Residue:462
BDBM50040023
NameBDBM50040023
Synonyms:4-(3-Fluoro-5,5,8,8-tetramethyl-5,6,7,8-tetrahydro-naphthalene-2-carbonyl)-benzoic acid | CHEMBL419166
TypeSmall organic molecule
Emp. Form.C22H23FO3
Mol. Mass.354.4146
SMILESCC1(C)CCC(C)(C)c2cc(C(=O)c3ccc(cc3)C(O)=O)c(F)cc12