Reaction Details
TargetRetinoic acid receptor RXR-beta
LigandBDBM50032675
Substrate/Competitorn/a
Meas. Tech.ChEMBL_196630 (CHEMBL798184)
EC50 24±n/a nM
Citation Boehm, MFZhang, LBadea, BAWhite, SKMais, DEBerger, ESuto, CMGoldman, MEHeyman, RA Synthesis and structure-activity relationships of novel retinoid X receptor-selective retinoids. J Med Chem37:2930-41 (1994) Retinoic acid receptor RXR-beta
Name:Retinoic acid receptor RXR-beta
Type:PROTEIN
Mol. Mass.:55877.78
Organism:Mus musculus
Description:ChEMBL_196588
Residue:520
BDBM50032675
NameBDBM50032675
Synonyms:4-[1-(3,5,5,8,8-pentamethyl-5,6,7,8-tetrahydronaphthalen-2-yl)vinyl]benzoic acid CHEMBL1023 | p-(1-(5,6,7,8-Tetrahydro-3,5,5,8,8-pentamethyl-2-naphthyl)vinyl)benzoic acid
TypeSmall organic molecule
Emp. Form.C24H28O2
Mol. Mass.348.4779
SMILESCc1cc2c(cc1C(=C)c1ccc(cc1)C(O)=O)C(C)(C)CCC2(C)C