Reaction Details
TargetRetinoic acid receptor RXR-alpha
LigandBDBM50040012
Substrate/Competitorn/a
Meas. Tech.ChEMBL_196482 (CHEMBL798296)
Kd 28±n/a nM
Citation Boehm, MFZhang, LBadea, BAWhite, SKMais, DEBerger, ESuto, CMGoldman, MEHeyman, RA Synthesis and structure-activity relationships of novel retinoid X receptor-selective retinoids. J Med Chem37:2930-41 (1994) Retinoic acid receptor RXR-alpha
Name:Retinoic acid receptor RXR-alpha
Type:PROTEIN
Mol. Mass.:50820.38
Organism:Homo sapiens (Human)
Description:ChEMBL_1456363
Residue:462
BDBM50040012
NameBDBM50040012
Synonyms:4-[1-(3-Bromo-5,5,8,8-tetramethyl-5,6,7,8-tetrahydro-naphthalen-2-yl)-vinyl]-benzoic acid | CHEMBL101661
TypeSmall organic molecule
Emp. Form.C23H25BrO2
Mol. Mass.413.347
SMILESCC1(C)CCC(C)(C)c2cc(C(=C)c3ccc(cc3)C(O)=O)c(Br)cc12