Reaction Details
TargetRetinoic acid receptor beta
LigandBDBM50040014
Substrate/Competitorn/a
Meas. Tech.ChEMBL_196658 (CHEMBL799693)
EC50 337.0±n/a nM
Citation Boehm, MFZhang, LBadea, BAWhite, SKMais, DEBerger, ESuto, CMGoldman, MEHeyman, RA Synthesis and structure-activity relationships of novel retinoid X receptor-selective retinoids. J Med Chem37:2930-41 (1994) Retinoic acid receptor beta
Name:Retinoic acid receptor beta
Type:PROTEIN
Mol. Mass.:50498.70
Organism:Homo sapiens (Human)
Description:ChEMBL_1458015
Residue:455
BDBM50040014
NameBDBM50040014
Synonyms:4-[1-(3-Fluoro-5,5,8,8-tetramethyl-5,6,7,8-tetrahydro-naphthalen-2-yl)-vinyl]-benzoic acid | CHEMBL330593
TypeSmall organic molecule
Emp. Form.C23H25FO2
Mol. Mass.352.4418
SMILESCC1(C)CCC(C)(C)c2cc(C(=C)c3ccc(cc3)C(O)=O)c(F)cc12