Reaction Details
TargetRetinoic acid receptor RXR-alpha
LigandBDBM50040017
Substrate/Competitorn/a
Meas. Tech.ChEMBL_196472 (CHEMBL879373)
EC50 115±n/a nM
Citation Boehm, MFZhang, LBadea, BAWhite, SKMais, DEBerger, ESuto, CMGoldman, MEHeyman, RA Synthesis and structure-activity relationships of novel retinoid X receptor-selective retinoids. J Med Chem37:2930-41 (1994) Retinoic acid receptor RXR-alpha
Name:Retinoic acid receptor RXR-alpha
Type:PROTEIN
Mol. Mass.:50820.38
Organism:Homo sapiens (Human)
Description:ChEMBL_1456363
Residue:462
BDBM50040017
NameBDBM50040017
Synonyms:4-[1-(3-Ethyl-5,5,8,8-tetramethyl-5,6,7,8-tetrahydro-naphthalen-2-yl)-vinyl]-benzoic acid | CHEMBL100623
TypeSmall organic molecule
Emp. Form.C25H30O2
Mol. Mass.362.5045
SMILESCCc1cc2c(cc1C(=C)c1ccc(cc1)C(O)=O)C(C)(C)CCC2(C)C