Reaction Details
TargetRetinoic acid receptor RXR-beta
LigandBDBM50040014
Substrate/Competitorn/a
Meas. Tech.ChEMBL_196631 (CHEMBL798185)
Kd 108±n/a nM
Citation Boehm, MFZhang, LBadea, BAWhite, SKMais, DEBerger, ESuto, CMGoldman, MEHeyman, RA Synthesis and structure-activity relationships of novel retinoid X receptor-selective retinoids. J Med Chem37:2930-41 (1994) Retinoic acid receptor RXR-beta
Name:Retinoic acid receptor RXR-beta
Type:PROTEIN
Mol. Mass.:55877.78
Organism:Mus musculus
Description:ChEMBL_196588
Residue:520
BDBM50040014
NameBDBM50040014
Synonyms:4-[1-(3-Fluoro-5,5,8,8-tetramethyl-5,6,7,8-tetrahydro-naphthalen-2-yl)-vinyl]-benzoic acid | CHEMBL330593
TypeSmall organic molecule
Emp. Form.C23H25FO2
Mol. Mass.352.4418
SMILESCC1(C)CCC(C)(C)c2cc(C(=C)c3ccc(cc3)C(O)=O)c(F)cc12