Reaction Details
TargetD(2) dopamine receptor
LigandBDBM50040079
Substrate/Competitorn/a
Meas. Tech.ChEBML_62557
Ki 0.019000±n/a nM
Citation Chumpradit, SKung, MPBillings, JMach, RKung, HF Fluorinated and iodinated dopamine agents: D2 imaging agents for PET and SPECT. J Med Chem36:221-8 (1993) D(2) dopamine receptor
Name:D(2) dopamine receptor
Type:G Protein-Coupled Receptor (GPCR)
Mol. Mass.:50931.60
Organism:Rattus norvegicus (rat)
Description:P61169
Residue:444
BDBM50040079
NameBDBM50040079
Synonyms:CHEMBL308524 N-(1-Ethyl-pyrrolidin-2-ylmethyl)-2-hydroxy-3-iodo-5,6-dimethoxy-benzamide( NCQ 298)
TypeSmall organic molecule
Emp. Form.C16H23IN2O4
Mol. Mass.434.2693
SMILESCCN1CCC[C@H]1CNC(=O)c1c(O)c(I)cc(OC)c1OC