Reaction Details
TargetHistamine H1 receptor
LigandBDBM50040121
Substrate/Competitorn/a
Meas. Tech.ChEMBL_83929 (CHEMBL693694)
Ki 20±n/a nM
Citation Ohshima, ETakami, HHarakawa, HSato, HObase, HMiki, IIshii, AIshii, HSasaki, YOhmori, K Dibenz[b,e]oxepin derivatives: novel antiallergic agents possessing thromboxane A2 and histamine H1 dual antagonizing activity. 1. J Med Chem36:417-20 (1993) Histamine H1 receptor
Name:Histamine H1 receptor
Type:G Protein-Coupled Receptor (GPCR)
Mol. Mass.:55641.53
Organism:Cavia porcellus (domestic guinea pig)
Description:Guinea pig cerebellum was used in binding assay.
Residue:488
BDBM50040121
NameBDBM50040121
Synonyms:11-[2-(4-Phenyl-piperidin-1-yl)-ethylsulfanyl]-6,11-dihydro-dibenzo[b,e]oxepine-2-carboxylic acid | CHEMBL134424
TypeSmall organic molecule
Emp. Form.C28H29NO3S
Mol. Mass.459.6
SMILESOC(=O)c1ccc2OCc3ccccc3C(SCCN3CCC(CC3)c3ccccc3)c2c1