Reaction Details
TargetHistamine H1 receptor
LigandBDBM50002088
Substrate/Competitorn/a
Meas. Tech.ChEMBL_83929 (CHEMBL693694)
Ki 11±n/a nM
Citation Ohshima, ETakami, HHarakawa, HSato, HObase, HMiki, IIshii, AIshii, HSasaki, YOhmori, K Dibenz[b,e]oxepin derivatives: novel antiallergic agents possessing thromboxane A2 and histamine H1 dual antagonizing activity. 1. J Med Chem36:417-20 (1993) Histamine H1 receptor
Name:Histamine H1 receptor
Type:G Protein-Coupled Receptor (GPCR)
Mol. Mass.:55641.53
Organism:Cavia porcellus (domestic guinea pig)
Description:Guinea pig cerebellum was used in binding assay.
Residue:488
BDBM50002088
NameBDBM50002088
Synonyms:CHEMBL302005 | [11-(2-Dimethylamino-ethylidene)-6,11-dihydro-dibenzo[b,e]oxepin-2-yl]-acetic acid
TypeSmall organic molecule
Emp. Form.C20H21NO3
Mol. Mass.323.3856
SMILESCN(C)C\C=C1/c2ccccc2COc2ccc(CC(O)=O)cc12