Reaction Details
TargetHistamine H1 receptor
LigandBDBM50040111
Substrate/Competitorn/a
Meas. Tech.ChEMBL_83929 (CHEMBL693694)
Ki 20±n/a nM
Citation Ohshima, ETakami, HHarakawa, HSato, HObase, HMiki, IIshii, AIshii, HSasaki, YOhmori, K Dibenz[b,e]oxepin derivatives: novel antiallergic agents possessing thromboxane A2 and histamine H1 dual antagonizing activity. 1. J Med Chem36:417-20 (1993) Histamine H1 receptor
Name:Histamine H1 receptor
Type:G Protein-Coupled Receptor (GPCR)
Mol. Mass.:55641.53
Organism:Cavia porcellus (domestic guinea pig)
Description:Guinea pig cerebellum was used in binding assay.
Residue:488
BDBM50040111
NameBDBM50040111
Synonyms:CHEMBL133080 | {11-[2-(4-Benzyl-piperidin-1-yl)-ethylidene]-6,11-dihydro-dibenzo[b,e]oxepin-2-yl}-acetic acid
TypeSmall organic molecule
Emp. Form.C30H31NO3
Mol. Mass.453.572
SMILESOC(=O)Cc1ccc2OCc3ccccc3\C(=C/CN3CCC(Cc4ccccc4)CC3)c2c1