Reaction Details
TargetKappa-type opioid receptor
LigandBDBM50040130
Substrate/Competitorn/a
Meas. Tech.ChEMBL_223429 (CHEMBL845232)
IC50 0.420000±n/a nM
Citation Kawasaki, AMKnapp, RJKramer, THWalton, AWire, WSHashimoto, SYamamura, HIPorreca, FBurks, TFHruby, VJ Design and synthesis of highly potent and selective cyclic dynorphin A analogs. 2. New analogs. J Med Chem36:750-7 (1993) Kappa-type opioid receptor
Name:Kappa-type opioid receptor
Type:G Protein-Coupled Receptor (GPCR)
Mol. Mass.:42744.99
Organism:Cavia porcellus (domestic guinea pig)
Description:P41144
Residue:380
BDBM50040130
NameBDBM50040130
Synonyms:CHEMBL415406 | Tyr-Gly-Gly-Phe-c(Cys-Arg-Arg-Ile-Cys)-Arg-lys
TypeSmall organic molecule
Emp. Form.C58H93N21O13S2
Mol. Mass.1356.622
SMILESCC[C@H](C)[C@H]1NC(=O)[C@H](CCCNC(N)=N)NC(=O)[C@@H](CCCNC(N)=N)NC(=O)[C@@H](CSSC[C@@H](NC1=O)C(=O)N[C@H](CCCNC(N)=N)C(=O)N[C@H](CCCCN)C(O)=O)NC(=O)[C@H](Cc1ccccc1)NC(=O)CNC(=O)CNC(=O)[C@@H](N)Cc1ccc(O)cc1