Reaction Details
Target5-hydroxytryptamine receptor 1A
LigandBDBM50040175
Substrate/Competitorn/a
Meas. Tech.ChEMBL_578 (CHEMBL615448)
Ki 0.1±n/a nM
Citation Lin, CHHaadsma-Svensson, SRLahti, RAMcCall, RBPiercey, MFSchreur, PJVon Voigtlander, PFSmith, MWChidester, CG Centrally acting serotonergic and dopaminergic agents. 1. Synthesis and structure-activity relationships of 2,3,3a,4,5,9b-hexahydro-1H-benz[e]indole derivatives. J Med Chem36:1053-68 (1993) 5-hydroxytryptamine receptor 1A
Name:5-hydroxytryptamine receptor 1A
Type:n/a
Mol. Mass.:46122.49
Organism:Homo sapiens (Human)
Description:n/a
Residue:422
BDBM50040175
NameBDBM50040175
Synonyms:3-Propyl-2,3,3a,4,5,9b-hexahydro-1H-benzo[e]indol-9-ol | CHEMBL9979
TypeSmall organic molecule
Emp. Form.C15H21NO
Mol. Mass.231.3333
SMILESCCCN1CCC2[C@H]1CCc1cccc(O)c21