Reaction Details
TargetGastrin-releasing peptide receptor
LigandBDBM50040303
Substrate/Competitorn/a
Meas. Tech.ChEMBL_458 (CHEMBL615688)
IC50 140±n/a nM
Citation Leban, JJLandavazo, AMcDermed, JDDiliberto, EJJansen, MStockstill, BKull, FC Potent gastrin-releasing peptide (GRP) antagonists derived from GRP (19-27) with a C-terminal DPro psi [CH2NH]Phe-NH2 and N-terminal aromatic residues. J Med Chem37:439-45 (1994) Gastrin-releasing peptide receptor
Name:Gastrin-releasing peptide receptor
Type:Enzyme Catalytic Domain
Mol. Mass.:43234.59
Organism:MOUSE
Description:Gastrin-Releasing peptide 0 MOUSE::P21729
Residue:384
BDBM50040303
NameBDBM50040303
Synonyms:CHEMBL383984 PhCH2CH2(CO)His-Trp-Ala-Val-DAla-His-Pro(CH(OH)CH2(CO))-Phe-NH2
TypeSmall organic molecule
Emp. Form.C59H74N14O10
Mol. Mass.1139.3067
SMILESCC(C)[C@H](NC(=O)[C@H](C)NC(=O)[C@H](Cc1c[nH]c2ccccc12)NC(=O)[C@H](Cc1cnc[nH]1)NC(=O)CCc1ccccc1)C(=O)N[C@@H](C)C(=O)N[C@@H](Cc1cnc[nH]1)C(=O)N1CCC[C@@H]1C(O)CC(=O)N[C@@H](Cc1ccccc1)C(N)=O