Reaction Details
TargetGastrin-releasing peptide receptor
LigandBDBM50040316
Substrate/Competitorn/a
Meas. Tech.ChEMBL_458 (CHEMBL615688)
IC50 0.570000±n/a nM
Citation Leban, JJLandavazo, AMcDermed, JDDiliberto, EJJansen, MStockstill, BKull, FC Potent gastrin-releasing peptide (GRP) antagonists derived from GRP (19-27) with a C-terminal DPro psi [CH2NH]Phe-NH2 and N-terminal aromatic residues. J Med Chem37:439-45 (1994) Gastrin-releasing peptide receptor
Name:Gastrin-releasing peptide receptor
Type:Enzyme Catalytic Domain
Mol. Mass.:43234.59
Organism:MOUSE
Description:Gastrin-Releasing peptide 0 MOUSE::P21729
Residue:384
BDBM50040316
NameBDBM50040316
Synonyms:3-isoquinolyl(CO)His-Trp-Ala-Val-DAla-His-DPro(psi)Phe-NH2 | CHEMBL412579
TypeSmall organic molecule
Emp. Form.C58H69N15O8
Mol. Mass.1104.2642
SMILESCC(C)[C@H](NC(=O)[C@H](C)NC(=O)[C@H](Cc1c[nH]c2ccccc12)NC(=O)[C@H](Cc1cnc[nH]1)NC(=O)c1cc2ccccc2cn1)C(=O)N[C@H](C)C(=O)N[C@@H](Cc1cnc[nH]1)C(=O)N1CCC[C@@H]1CN[C@@H](Cc1ccccc1)C(N)=O