Reaction Details
TargetAdenosylhomocysteinase
LigandBDBM50034176
Substrate/Competitorn/a
Meas. Tech.ChEMBL_196561 (CHEMBL802429)
Ki 11.1±n/a nM
Citation Siddiqi, SMChen, XSchneller, SWIkeda, SSnoeck, RAndrei, GBalzarini, JDe Clercq, E Antiviral enantiomeric preference for 5'-noraristeromycin. J Med Chem37:551-4 (1994) Adenosylhomocysteinase
Name:Adenosylhomocysteinase
Type:PROTEIN
Mol. Mass.:47687.65
Organism:Mus musculus
Description:ChEMBL_196559
Residue:432
BDBM50034176
NameBDBM50034176
Synonyms:4-(6-Amino-purin-9-yl)-cyclopentane-1,2,3-triol | CHEMBL8275
TypeSmall organic molecule
Emp. Form.C10H13N5O3
Mol. Mass.251.2419
SMILESNc1ncnc2n(cnc12)C1CC(O)C(O)C1O