Reaction Details
TargetPlatelet-activating factor acetylhydrolase [136-227]
LigandBDBM50040461
Substrate/Competitorn/a
Meas. Tech.ChEMBL_156340 (CHEMBL759983)
IC50 30±n/a nM
Citation Beaton, HGBennion, CConnolly, SCook, ARGensmantel, NPHallam, CHardy, KHitchin, BJackson, CGRobinson, DH Discovery of new non-phospholipid inhibitors of the secretory phospholipases A2. J Med Chem37:557-9 (1994) Platelet-activating factor acetylhydrolase [136-227]
Name:Platelet-activating factor acetylhydrolase [136-227]
Type:PROTEIN
Mol. Mass.:10360.56
Organism:Sus scrofa
Description:ChEMBL_156342
Residue:92
BDBM50040461
NameBDBM50040461
Synonyms:(S)-5-(4-Benzyl-phenylsulfanyl)-4-((S)-7-phenyl-heptanoylamino)-pentanoic acid CHEMBL434630
TypeSmall organic molecule
Emp. Form.C31H37NO3S
Mol. Mass.503.695
SMILESOC(=O)CC[C@@H](CSc1ccc(Cc2ccccc2)cc1)NC(=O)CCCCCCc1ccccc1