Reaction Details
TargetPlatelet-activating factor acetylhydrolase [136-227]
LigandBDBM50040455
Substrate/Competitorn/a
Meas. Tech.ChEMBL_156342 (CHEMBL759985)
IC50 30±n/a nM
Citation Beaton, HGBennion, CConnolly, SCook, ARGensmantel, NPHallam, CHardy, KHitchin, BJackson, CGRobinson, DH Discovery of new non-phospholipid inhibitors of the secretory phospholipases A2. J Med Chem37:557-9 (1994) Platelet-activating factor acetylhydrolase [136-227]
Name:Platelet-activating factor acetylhydrolase [136-227]
Type:PROTEIN
Mol. Mass.:10360.56
Organism:Sus scrofa
Description:ChEMBL_156342
Residue:92
BDBM50040455
NameBDBM50040455
Synonyms:(S)-4-(4-Benzyl-phenylsulfanyl)-3-((S)-(E)-dec-3-enoylamino)-butyric acid | CHEMBL152921
TypeSmall organic molecule
Emp. Form.C27H35NO3S
Mol. Mass.453.637
SMILESCCCCCC\C=C\CC(=O)N[C@H](CSc1ccc(Cc2ccccc2)cc1)CC(O)=O