Reaction Details
TargetInterstitial collagenase
LigandBDBM50040594
Substrate/Competitorn/a
Meas. Tech.ChEMBL_101733 (CHEMBL709089)
IC50 20±n/a nM
Citation Brown, FKBrown, PJBickett, DMChambers, CLDavies, HGDeaton, DNDrewry, DFoley, MMcElroy, ABGregson, M Matrix metalloproteinase inhibitors containing a (carboxyalkyl)amino zinc ligand: modification of the P1 and P2' residues. J Med Chem37:674-88 (1994) Interstitial collagenase
Name:Interstitial collagenase
Type:Enzyme
Mol. Mass.:54010.26
Organism:Homo sapiens (Human)
Description: P03956
Residue:469
BDBM50040594
NameBDBM50040594
Synonyms:(R)-4-(1,3-Dioxo-1,3-dihydro-benzo[f]isoindol-2-yl)-2-[(S)-3-methyl-1-((S)-1-methylcarbamoyl-2-phenyl-ethylcarbamoyl)-butylamino]-butyric acid | CHEMBL295798
TypeSmall organic molecule
Emp. Form.C32H36N4O6
Mol. Mass.572.6514
SMILESCNC(=O)[C@H](Cc1ccccc1)NC(=O)[C@H](CC(C)C)N[C@H](CCN1C(=O)c2cc3ccccc3cc2C1=O)C(O)=O