Reaction Details
TargetThymidylate synthase
LigandBDBM50040863
Substrate/Competitorn/a
Meas. Tech.ChEMBL_209644 (CHEMBL811585)
Ki 1.2±n/a nM
Citation Pendergast, WDickerson, SHDev, IKFerone, RDuch, DSSmith, GK Benzo[f]quinazoline inhibitors of thymidylate synthase: methyleneamino-linked aroylglutamate derivatives. J Med Chem37:838-44 (1994) Thymidylate synthase
Name:Thymidylate synthase
Type:Enzyme
Mol. Mass.:35718.07
Organism:Homo sapiens (Human)
Description:n/a
Residue:313
BDBM50040863
NameBDBM50040863
Synonyms:(S)-2-{4-[(3-Amino-1-oxo-1,2-dihydro-benzo[f]quinazolin-9-ylmethyl)-amino]-benzoylamino}-pentanedioic acid | CHEMBL355662
TypeSmall organic molecule
Emp. Form.C25H23N5O6
Mol. Mass.489.48
SMILESNc1nc2ccc3ccc(CNc4ccc(cc4)C(=O)N[C@@H](CCC(O)=O)C(O)=O)cc3c2c(=O)[nH]1