Reaction Details
TargetThymidylate synthase
LigandBDBM50040859
Substrate/Competitorn/a
Meas. Tech.ChEMBL_209643 (CHEMBL811584)
Ki 2.5±n/a nM
Citation Pendergast, WDickerson, SHDev, IKFerone, RDuch, DSSmith, GK Benzo[f]quinazoline inhibitors of thymidylate synthase: methyleneamino-linked aroylglutamate derivatives. J Med Chem37:838-44 (1994) Thymidylate synthase
Name:Thymidylate synthase
Type:Enzyme
Mol. Mass.:35718.07
Organism:Homo sapiens (Human)
Description:n/a
Residue:313
BDBM50040859
NameBDBM50040859
Synonyms:(S)-2-{5-[Methyl-(3-methyl-1-oxo-1,2-dihydro-benzo[f]quinazolin-9-ylmethyl)-amino]-1-oxo-1,3-dihydro-isoindol-2-yl}-pentanedioic acid | CHEMBL355616
TypeSmall organic molecule
Emp. Form.C28H26N4O6
Mol. Mass.514.5292
SMILESCN(Cc1ccc2ccc3nc(C)[nH]c(=O)c3c2c1)c1ccc2C(=O)N(Cc2c1)[C@@H](CCC(O)=O)C(O)=O