Reaction Details
TargetEpidermal growth factor receptor
LigandBDBM50040929
Substrate/Competitorn/a
Meas. Tech.ChEMBL_66568 (CHEMBL679549)
IC50 300±n/a nM
Citation Trinks, UBuchdunger, EFuret, PKump, WMett, HMeyer, TMüller, MRegenass, URihs, GLydon, N Dianilinophthalimides: potent and selective, ATP-competitive inhibitors of the EGF-receptor protein tyrosine kinase. J Med Chem37:1015-27 (1994) Epidermal growth factor receptor
Name:Epidermal growth factor receptor
Type:Receptor Kinase Domain
Mol. Mass.:134279.59
Organism:Homo sapiens (Human)
Description:P00533
Residue:1210
BDBM50040929
NameBDBM50040929
Synonyms:4,5-dianilinophthalimide CHEMBL268868 | Cgp 52411
TypeSmall organic molecule
Emp. Form.C20H15N3O2
Mol. Mass.329.352
SMILESO=C1NC(=O)c2cc(Nc3ccccc3)c(Nc3ccccc3)cc12