Reaction Details
TargetPlatelet-derived growth factor receptor alpha/beta
LigandBDBM50040919
Substrate/Competitorn/a
Meas. Tech.ChEMBL_454 (CHEMBL615685)
IC50>100000±n/a nM
Citation Trinks, UBuchdunger, EFuret, PKump, WMett, HMeyer, TMüller, MRegenass, URihs, GLydon, N Dianilinophthalimides: potent and selective, ATP-competitive inhibitors of the EGF-receptor protein tyrosine kinase. J Med Chem37:1015-27 (1994) Platelet-derived growth factor receptor alpha/beta
Name:Platelet-derived growth factor receptor alpha/beta
Type:n/a
Mol. Mass.:n/a
Description:ASSAY_ID of EBI is 454
Components:This complex has 2 components.
Component 1
Name:Platelet-derived growth factor receptor beta
Synonyms:2.7.10.1 Beta-type platelet-derived growth factor receptor CD140b antigen PDGF-R-beta PDGFR-beta Pdgfr Pdgfrb Platelet-derived growth factor receptor | Platelet-derived growth factor receptor 1
Type:Enzyme
Mol. Mass.:122771.00
Organism:Mus musculus (mouse)
Description:P05622
Residue:1098
Component 2
Name:Platelet-derived growth factor receptor alpha
Synonyms:PGFRA_MOUSE Platelet-derived growth factor receptor
Type:PROTEIN
Mol. Mass.:122646.66
Organism:Mus musculus
Description:EBI_12628
Residue:1089
BDBM50040919
NameBDBM50040919
Synonyms:5,6-Bis-(biphenyl-4-ylamino)-isoindole-1,3-dione | CHEMBL7929
TypeSmall organic molecule
Emp. Form.C32H23N3O2
Mol. Mass.481.5439
SMILESO=C1NC(=O)c2cc(Nc3ccc(cc3)-c3ccccc3)c(Nc3ccc(cc3)-c3ccccc3)cc12