Reaction Details
TargetcAMP-dependent protein kinase
LigandBDBM50040914
Substrate/Competitorn/a
Meas. Tech.ChEMBL_152945 (CHEMBL874643)
IC50>500000±n/a nM
Citation Trinks, UBuchdunger, EFuret, PKump, WMett, HMeyer, TMüller, MRegenass, URihs, GLydon, N Dianilinophthalimides: potent and selective, ATP-competitive inhibitors of the EGF-receptor protein tyrosine kinase. J Med Chem37:1015-27 (1994) cAMP-dependent protein kinase
Name:cAMP-dependent protein kinase
Type:Enzyme
Mol. Mass.:40766.33
Organism:Oryctolagus cuniculus (Rabbit)
Description:Q95J97
Residue:351
BDBM50040914
NameBDBM50040914
Synonyms:5-(4-Methoxy-phenylamino)-6-phenylamino-isoindole-1,3-dione | CHEMBL8095
TypeSmall organic molecule
Emp. Form.C21H17N3O3
Mol. Mass.359.378
SMILESCOc1ccc(Nc2cc3C(=O)NC(=O)c3cc2Nc2ccccc2)cc1