Reaction Details
TargetcAMP-dependent protein kinase
LigandBDBM50040922
Substrate/Competitorn/a
Meas. Tech.ChEMBL_152945 (CHEMBL874643)
IC50>500000±n/a nM
Citation Trinks, UBuchdunger, EFuret, PKump, WMett, HMeyer, TMüller, MRegenass, URihs, GLydon, N Dianilinophthalimides: potent and selective, ATP-competitive inhibitors of the EGF-receptor protein tyrosine kinase. J Med Chem37:1015-27 (1994) cAMP-dependent protein kinase
Name:cAMP-dependent protein kinase
Type:Enzyme
Mol. Mass.:40766.33
Organism:Oryctolagus cuniculus (Rabbit)
Description:Q95J97
Residue:351
BDBM50040922
NameBDBM50040922
Synonyms:2-Phenyl-5,6-bis-phenylamino-isoindole-1,3-dione | CHEMBL8000
TypeSmall organic molecule
Emp. Form.C26H19N3O2
Mol. Mass.405.448
SMILESO=C1N(C(=O)c2cc(Nc3ccccc3)c(Nc3ccccc3)cc12)c1ccccc1