Reaction Details
TargetTyrosine-protein kinase ABL1/ABL2
LigandBDBM2583
Substrate/Competitorn/a
Meas. Tech.ChEMBL_226209 (CHEMBL844139)
IC50 20000±n/a nM
Citation Trinks, UBuchdunger, EFuret, PKump, WMett, HMeyer, TMüller, MRegenass, URihs, GLydon, N Dianilinophthalimides: potent and selective, ATP-competitive inhibitors of the EGF-receptor protein tyrosine kinase. J Med Chem37:1015-27 (1994) Tyrosine-protein kinase ABL1/ABL2
Name:Tyrosine-protein kinase ABL1/ABL2
Synonyms:Tyrosine-protein kinase ABL
Type:n/a
Mol. Mass.:n/a
Description:ASSAY_ID of EBI is 226000
Components:This complex has 2 components.
Component 1
Name:Tyrosine-protein kinase ABL1
Type:Enzyme
Mol. Mass.:122897.30
Organism:Homo sapiens (Human)
Description:P00519
Residue:1130
Component 2
Name:Tyrosine-protein kinase ABL2
Synonyms:ABL2 ABLL Abelson murine leukemia viral oncogene homolog 2 Tyrosine kinase ARG | VHL/Tyrosine-protein kinase ABL2
Type:PROTEIN
Mol. Mass.:128360.63
Organism:Homo sapiens (Human)
Description:ChEMBL_325082
Residue:1182
BDBM2583
NameBDBM2583
Synonyms:3,4-Bis(3-indolyl)-1H-pyrrole-2,5-dione BIM-4 Bisindolylmaleimide deriv. 5 bis-indolylmaleimide deriv. 8a
TypeSmall organic molecule
Emp. Form.C20H13N3O2
Mol. Mass.327.3361
SMILESO=C1NC(=O)C(=C1c1c[nH]c2ccccc12)c1c[nH]c2ccccc12