Reaction Details
TargetNeprilysin
LigandBDBM50407297
Substrate/Competitorn/a
Meas. Tech.ChEMBL_144450 (CHEMBL755097)
Ki 0.700±n/a nM
Citation Fournié-Zaluski, MCCoric, PTurcaud, SRousselet, NGonzalez, WBarbe, BPham, IJullian, NMichel, JBRoques, BP New dual inhibitors of neutral endopeptidase and angiotensin-converting enzyme: rational design, bioavailability, and pharmacological responses in experimental hypertension. J Med Chem37:1070-83 (1994) Neprilysin
Name:Neprilysin
Type:Enzyme
Mol. Mass.:85505.38
Organism:Homo sapiens (Human)
Description:P08473
Residue:750
BDBM50407297
NameBDBM50407297
Synonyms:CHEMBL2052008
TypeSmall organic molecule
Emp. Form.C14H19NO3S
Mol. Mass.281.371
SMILESC[C@H](NC(=O)[C@H](CS)[C@@H](C)c1ccccc1)C(O)=O