Reaction Details
TargetAngiotensin-converting enzyme
LigandBDBM50041053
Substrate/Competitorn/a
Meas. Tech.ChEMBL_36915 (CHEMBL647116)
IC50 5±n/a nM
Citation Fournié-Zaluski, MCCoric, PTurcaud, SRousselet, NGonzalez, WBarbe, BPham, IJullian, NMichel, JBRoques, BP New dual inhibitors of neutral endopeptidase and angiotensin-converting enzyme: rational design, bioavailability, and pharmacological responses in experimental hypertension. J Med Chem37:1070-83 (1994) Angiotensin-converting enzyme
Name:Angiotensin-converting enzyme
Type:PROTEIN
Mol. Mass.:150916.88
Organism:Mus musculus
Description:ChEMBL_34763
Residue:1312
BDBM50041053
NameBDBM50041053
Synonyms:2-[3-(3,4-Difluoro-phenyl)-2-mercaptomethyl-butyrylamino]-propionic acid | CHEMBL276008
TypeSmall organic molecule
Emp. Form.C14H17F2NO3S
Mol. Mass.317.351
SMILESCC(NC(=O)C(CS)C(C)c1ccc(F)c(F)c1)C(O)=O