Reaction Details
TargetAngiotensin-converting enzyme
LigandBDBM50041051
Substrate/Competitorn/a
Meas. Tech.ChEMBL_36915 (CHEMBL647116)
IC50 14±n/a nM
Citation Fournié-Zaluski, MCCoric, PTurcaud, SRousselet, NGonzalez, WBarbe, BPham, IJullian, NMichel, JBRoques, BP New dual inhibitors of neutral endopeptidase and angiotensin-converting enzyme: rational design, bioavailability, and pharmacological responses in experimental hypertension. J Med Chem37:1070-83 (1994) Angiotensin-converting enzyme
Name:Angiotensin-converting enzyme
Type:PROTEIN
Mol. Mass.:150916.88
Organism:Mus musculus
Description:ChEMBL_34763
Residue:1312
BDBM50041051
NameBDBM50041051
Synonyms:2-[3-(4-Hydroxy-3-methoxy-phenyl)-2-mercaptomethyl-butyrylamino]-3-(4-hydroxy-phenyl)-propionic acid | CHEMBL11344
TypeSmall organic molecule
Emp. Form.C21H25NO6S
Mol. Mass.419.491
SMILESCOc1cc(ccc1O)C(C)C(CS)C(=O)NC(Cc1ccc(O)cc1)C(O)=O