Reaction Details
TargetAngiotensin-converting enzyme
LigandBDBM50041063
Substrate/Competitorn/a
Meas. Tech.ChEMBL_36915 (CHEMBL647116)
IC50 4±n/a nM
Citation Fournié-Zaluski, MCCoric, PTurcaud, SRousselet, NGonzalez, WBarbe, BPham, IJullian, NMichel, JBRoques, BP New dual inhibitors of neutral endopeptidase and angiotensin-converting enzyme: rational design, bioavailability, and pharmacological responses in experimental hypertension. J Med Chem37:1070-83 (1994) Angiotensin-converting enzyme
Name:Angiotensin-converting enzyme
Type:PROTEIN
Mol. Mass.:150916.88
Organism:Mus musculus
Description:ChEMBL_34763
Residue:1312
BDBM50041063
NameBDBM50041063
Synonyms:2-(2-Mercaptomethyl-3-phenyl-butyrylamino)-pentanoic acid | CHEMBL275690
TypeSmall organic molecule
Emp. Form.C16H23NO3S
Mol. Mass.309.424
SMILESCCCC(NC(=O)C(CS)C(C)c1ccccc1)C(O)=O