Reaction Details
TargetAngiotensin-converting enzyme
LigandBDBM50041062
Substrate/Competitorn/a
Meas. Tech.ChEMBL_36915 (CHEMBL647116)
IC50 3.6±n/a nM
Citation Fournié-Zaluski, MCCoric, PTurcaud, SRousselet, NGonzalez, WBarbe, BPham, IJullian, NMichel, JBRoques, BP New dual inhibitors of neutral endopeptidase and angiotensin-converting enzyme: rational design, bioavailability, and pharmacological responses in experimental hypertension. J Med Chem37:1070-83 (1994) Angiotensin-converting enzyme
Name:Angiotensin-converting enzyme
Type:PROTEIN
Mol. Mass.:150916.88
Organism:Mus musculus
Description:ChEMBL_34763
Residue:1312
BDBM50041062
NameBDBM50041062
Synonyms:3-(4-Hydroxy-phenyl)-2-[2-mercaptomethyl-3-(4-methoxy-phenyl)-butyrylamino]-propionic acid | CHEMBL273853
TypeSmall organic molecule
Emp. Form.C21H25NO5S
Mol. Mass.403.492
SMILESCOc1ccc(cc1)C(C)C(CS)C(=O)NC(Cc1ccc(O)cc1)C(O)=O