Reaction Details
TargetNeprilysin
LigandBDBM50041067
Substrate/Competitorn/a
Meas. Tech.ChEMBL_144449 (CHEMBL755096)
IC50 2±n/a nM
Citation Fournié-Zaluski, MCCoric, PTurcaud, SRousselet, NGonzalez, WBarbe, BPham, IJullian, NMichel, JBRoques, BP New dual inhibitors of neutral endopeptidase and angiotensin-converting enzyme: rational design, bioavailability, and pharmacological responses in experimental hypertension. J Med Chem37:1070-83 (1994) Neprilysin
Name:Neprilysin
Type:Enzyme
Mol. Mass.:85505.38
Organism:Homo sapiens (Human)
Description:P08473
Residue:750
BDBM50041067
NameBDBM50041067
Synonyms:2-[3-(4-Fluoro-phenyl)-2-mercaptomethyl-butyrylamino]-propionic acid | CHEMBL11297
TypeSmall organic molecule
Emp. Form.C14H18FNO3S
Mol. Mass.299.361
SMILESCC(NC(=O)C(CS)C(C)c1ccc(F)cc1)C(O)=O