Reaction Details
TargetAngiotensin-converting enzyme
LigandBDBM50407298
Substrate/Competitorn/a
Meas. Tech.ChEMBL_34763 (CHEMBL643788)
Ki 10±n/a nM
Citation Fournié-Zaluski, MCCoric, PTurcaud, SRousselet, NGonzalez, WBarbe, BPham, IJullian, NMichel, JBRoques, BP New dual inhibitors of neutral endopeptidase and angiotensin-converting enzyme: rational design, bioavailability, and pharmacological responses in experimental hypertension. J Med Chem37:1070-83 (1994) Angiotensin-converting enzyme
Name:Angiotensin-converting enzyme
Type:PROTEIN
Mol. Mass.:150916.88
Organism:Mus musculus
Description:ChEMBL_34763
Residue:1312
BDBM50407298
NameBDBM50407298
Synonyms:CHEMBL2051772
TypeSmall organic molecule
Emp. Form.C20H23NO3S
Mol. Mass.357.467
SMILESC[C@@H]([C@@H](CS)C(=O)N[C@@H](Cc1ccccc1)C(O)=O)c1ccccc1