Reaction Details
TargetGag-Pol polyprotein [489-587]
LigandBDBM904
Substrate/Competitorn/a
Meas. Tech.ChEMBL_159974 (CHEMBL768121)
Ki 1670±n/a nM
Citation Reddy, MRVarney, MDKalish, VViswanadhan, VNAppelt, K Calculation of relative differences in the binding free energies of HIV1 protease inhibitors: a thermodynamic cycle perturbation approach. J Med Chem37:1145-52 (1994) Gag-Pol polyprotein [489-587]
Name:Gag-Pol polyprotein [489-587]
Type:Enzyme Subunit
Mol. Mass.:10781.16
Organism:Human immunodeficiency virus type 1
Description:P04585[489-587]
Residue:99
BDBM904
NameBDBM904
Synonyms:(4S,5S)-5-[(2S)-2-[(2S)-2-aminopropanamido]propanamido]-N-(diphenylmethyl)-4-hydroxy-6-phenylhexanamide C-terminal inhibitor 2 | CHEMBL15444
TypeSmall organic molecule
Emp. Form.C31H38N4O4
Mol. Mass.530.6578
SMILESC[C@H](N)C(=O)N[C@@H](C)C(=O)N[C@@H](Cc1ccccc1)[C@@H](O)CCC(=O)NC(c1ccccc1)c1ccccc1