Reaction Details
TargetSigma non-opioid intracellular receptor 1
LigandBDBM50041251
Substrate/Competitorn/a
Meas. Tech.ChEMBL_200976 (CHEMBL802063)
Ki 0.48±n/a nM
Citation Glennon, RAAblordeppey, SYIsmaiel, AMel-Ashmawy, MBFischer, JBHowie, KB Structural features important for sigma 1 receptor binding. J Med Chem37:1214-9 (1994) Sigma non-opioid intracellular receptor 1
Name:Sigma non-opioid intracellular receptor 1
Type:Enzyme Catalytic Domain
Mol. Mass.:25124.85
Organism:Homo sapiens (Human)
Description:Q99720
Residue:223
BDBM50041251
NameBDBM50041251
Synonyms:1-(5-Phenyl-pentyl)-piperidine | CHEMBL20188
TypeSmall organic molecule
Emp. Form.C16H25N
Mol. Mass.231.3764
SMILESC(CCN1CCCCC1)CCc1ccccc1