Reaction Details
TargetNeutrophil elastase
LigandBDBM50036112
Substrate/Competitorn/a
Meas. Tech.ChEMBL_63996 (CHEMBL673105)
Ki 6.6±n/a nM
Citation Brown, FJAndisik, DWBernstein, PRBryant, CBCeccarelli, CDamewood, JREdwards, PDEarley, RAFeeney, SGreen, RC Design of orally active, non-peptidic inhibitors of human leukocyte elastase. J Med Chem37:1259-61 (1994) Neutrophil elastase
Name:Neutrophil elastase
Type:Enzyme
Mol. Mass.:28532.38
Organism:Homo sapiens (Human)
Description:P08246
Residue:267
BDBM50036112
NameBDBM50036112
Synonyms:CHEMBL11403 | {6-Oxo-2-phenyl-1-[(3,3,3-trifluoro-1-isopropyl-2-oxo-propylcarbamoyl)-methyl]-1,6-dihydro-pyrimidin-5-yl}-carbamic acid benzyl ester
TypeSmall organic molecule
Emp. Form.C26H25F3N4O5
Mol. Mass.530.4957
SMILESCC(C)C(NC(=O)Cn1c(ncc(NC(=O)OCc2ccccc2)c1=O)-c1ccccc1)C(=O)C(F)(F)F