Reaction Details
TargetEndothelin-1 receptor
LigandBDBM50041619
Substrate/Competitorn/a
Meas. Tech.ChEMBL_65651 (CHEMBL678071)
Ki 5666.0±n/a nM
Citation Elliott, JDLago, MACousins, RDGao, ALeber, JDErhard, KFNambi, PElshourbagy, NAKumar, CLee, JA 1,3-Diarylindan-2-carboxylic acids, potent and selective non-peptide endothelin receptor antagonists. J Med Chem37:1553-7 (1994) Endothelin-1 receptor
Name:Endothelin-1 receptor
Type:Enzyme Catalytic Domain
Mol. Mass.:48736.88
Organism:Homo sapiens (Human)
Description:P25101
Residue:427
BDBM50041619
NameBDBM50041619
Synonyms:(1S,2S,3R)-1-(4-Methoxy-phenyl)-3-phenyl-indan-2-carboxylic acid | CHEMBL39057
TypeSmall organic molecule
Emp. Form.C23H20O3
Mol. Mass.344.4031
SMILESCOc1ccc(cc1)[C@@H]1[C@H]([C@@H](c2ccccc12)c1ccccc1)C(O)=O