Reaction Details
TargetEndothelin receptor type B
LigandBDBM50041620
Substrate/Competitorn/a
Meas. Tech.ChEMBL_63849 (CHEMBL673233)
Ki>30000±n/a nM
Citation Elliott, JDLago, MACousins, RDGao, ALeber, JDErhard, KFNambi, PElshourbagy, NAKumar, CLee, JA 1,3-Diarylindan-2-carboxylic acids, potent and selective non-peptide endothelin receptor antagonists. J Med Chem37:1553-7 (1994) Endothelin receptor type B
Name:Endothelin receptor type B
Type:Enzyme Catalytic Domain
Mol. Mass.:49664.00
Organism:Homo sapiens (Human)
Description:ENDOTHELIN B EDNRB HUMAN::P24530
Residue:442
BDBM50041620
NameBDBM50041620
Synonyms:(1R,2R,3S)-1,3-Diphenyl-indan-2-carboxylic acid | CHEMBL39171
TypeSmall organic molecule
Emp. Form.C22H18O2
Mol. Mass.314.3771
SMILESOC(=O)[C@H]1[C@@H](c2ccccc2[C@@H]1c1ccccc1)c1ccccc1