Reaction Details
TargetPolyunsaturated fatty acid 5-lipoxygenase
LigandBDBM50041802
Substrate/Competitorn/a
Meas. Tech.ChEMBL_4298 (CHEMBL618407)
IC50 7000±n/a nM
Citation Müller, KLeukel, PZiereis, KGawlik, I Antipsoriatic anthrones with modulated redox properties. 2. Novel derivatives of chrysarobin and isochrysarobin--antiproliferative activity and 5-lipoxygenase inhibition. J Med Chem37:1660-9 (1994) Polyunsaturated fatty acid 5-lipoxygenase
Name:Polyunsaturated fatty acid 5-lipoxygenase
Type:Enzyme
Mol. Mass.:77972.74
Organism:Homo sapiens (Human)
Description:Recombinant protein was purified from E. coli lysate. After ammonium sulfate precipitation and subsequent steps, the supernatant (S100) was used for 5-LO activity assay.
Residue:674
BDBM50041802
NameBDBM50041802
Synonyms:1,8-dihydroxy-9(10H)-anthracenone 1,8-dihydroxyanthracen-9(10H)-one CHEMBL46469 anthralin dithranol
TypeSmall organic molecule
Emp. Form.C14H10O3
Mol. Mass.226.2274
SMILESOc1cccc2Cc3cccc(O)c3C(=O)c12