Reaction Details
Target3',5'-cyclic-AMP phosphodiesterase
LigandBDBM50041880
Substrate/Competitorn/a
Meas. Tech.ChEMBL_157209 (CHEMBL768860)
IC50 400±n/a nM
Citation Ashton, MJCook, DCFenton, GKarlsson, JAPalfreyman, MNRaeburn, DRatcliffe, AJSouness, JEThurairatnam, SVicker, N Selective type IV phosphodiesterase inhibitors as antiasthmatic agents. The syntheses and biological activities of 3-(cyclopentyloxy)-4-methoxybenzamides and analogues. J Med Chem37:1696-703 (1994) 3',5'-cyclic-AMP phosphodiesterase
Name:3',5'-cyclic-AMP phosphodiesterase
Synonyms:Phosphodiesterase 4A
Type:PROTEIN
Mol. Mass.:13615.65
Organism:Sus scrofa
Description:ChEMBL_155848
Residue:118
BDBM50041880
NameBDBM50041880
TypeSmall organic molecule
Emp. Form.C17H19Cl2N3O3
Mol. Mass.384.257
SMILESCOc1ccc(cc1OC1CCCC1)C(=O)NN1C(Cl)C=CN=C1Cl